BDBM50184418 CHEMBL3822572
SMILES Cn1ccc(CN(c2nc(cs2)-c2ccccn2)c2ccc3[nH]ncc3c2)n1
InChI Key InChIKey=DDEMFZYBCBJLRK-UHFFFAOYSA-N
Data  4 IC50
  Tab Delimited (TSV)   2D SDfile   Computed 3D by Vconf -m prep SDfile
Find this compound or compounds like it in BindingDB:
Activity Spreadsheet -- Enzyme Inhibition Constant Data from BindingDB
Found 4 hits for monomerid = 50184418
TargetGlutamate receptor 1(Homo sapiens (Human))
Eli Lilly
Curated by ChEMBL
LigandPNGBDBM50184418(CHEMBL3822572)
Affinity DataIC50:  8.33E+4nM. Assay description: Antagonist activity at human iGluA1 receptor flip isoform expressed in CHO-S cells assessed as inhibition of glutamate-induced increase in intracellu...
In DepthDetails ArticlePubMed
TargetCytochrome P450 1A2(Homo sapiens (Human))
Eli Lilly
Curated by ChEMBL
LigandPNGBDBM50184418(CHEMBL3822572)
Affinity DataIC50: >1.00E+4nM. Assay description: Inhibition of human CYP1A2
In DepthDetails ArticlePubMed
TargetGlutamate receptor 1(Homo sapiens (Human))
Eli Lilly
Curated by ChEMBL
LigandPNGBDBM50184418(CHEMBL3822572)
Affinity DataIC50:  8.33E+4nM. Assay description: Antagonist activity at human iGluA1 receptor flop isoform expressed in CHO-S cells coexpressing TARP gamma-2 assessed as inhibition of glutamate-indu...
In DepthDetails ArticlePubMed
TargetGlutamate receptor 1(Homo sapiens (Human))
Eli Lilly
Curated by ChEMBL
LigandPNGBDBM50184418(CHEMBL3822572)
Affinity DataIC50:  54nM. Assay description: Antagonist activity at human iGluA1 receptor flop isoform expressed in CHO-S cells coexpressing TARP gamma-8 and human EAAT3 assessed as inhibition o...
In DepthDetails ArticlePubMed