BDBM50185189 12-methyl-6,7-dihydro-12H-5-thia-12-aza-dibenzo[a,e]azulen-10-ol::CHEMBL210570
SMILES Cn1c-2c(CCSc3ccccc-23)c2ccc(O)cc12
InChI Key InChIKey=MYTWZEUCXJEBME-UHFFFAOYSA-N
Data  1 IC50
  Tab Delimited (TSV)   2D SDfile   Computed 3D by Vconf -m prep SDfile
Find this compound or compounds like it in BindingDB:
Activity Spreadsheet -- Enzyme Inhibition Constant Data from BindingDB
Found 1 hit for monomerid = 50185189
TargetAndrogen receptor(Rattus norvegicus (Rat))
Johnson & Johnson Pharmaceutical Research And Development
Curated by ChEMBL
LigandPNGBDBM50185189(12-methyl-6,7-dihydro-12H-5-thia-12-aza-dibenzo[a,...)
Affinity DataIC50:  5.00E+3nM. Assay description: Inhibition of rat AR-mediated reporter gene expression in COS7 cells
In DepthDetails ArticlePubMed