BDBM50185479 CHEMBL3823110
SMILES C\C=C(\C=O)[C@H](CC(=O)OCCc1ccc(O)cc1)C=O
InChI Key InChIKey=JJJDPXQNHVTHRV-VJWXVMMXSA-N
Data  1 IC50
  Tab Delimited (TSV)   2D SDfile   Computed 3D by Vconf -m prep SDfile
Find this compound or compounds like it in BindingDB:
Activity Spreadsheet -- Enzyme Inhibition Constant Data from BindingDB
Found 1 hit for monomerid = 50185479
TargetHepatocyte growth factor receptor(Homo sapiens (Human))
University Of Louisiana At Monroe
Curated by ChEMBL
LigandPNGBDBM50185479(CHEMBL3823110)
Affinity DataIC50:  5.20E+3nM. Assay description: Inhibition of recombinant human N-terminal His-tagged cytoplasmic c-MET kinase domain (956 to 1390 residues) phosphorylation expressed in baculovirus...
In DepthDetails ArticlePubMed