BDBM50187236 (S)-5-[4-(2-piperidin-1-yl-ethoxy)-phenyl]-5,11-dihydro-chromeno[4,3-c]chromene-2,8-diol::CHEMBL207324
SMILES Oc1ccc2C3=C(COc2c1)c1ccc(O)cc1O[C@H]3c1ccc(OCCN2CCCCC2)cc1
InChI Key InChIKey=DHRWPORNZCWGED-LJAQVGFWSA-N
Data  2 IC50
  Tab Delimited (TSV)   2D SDfile   Computed 3D by Vconf -m prep SDfile
Find this compound or compounds like it in BindingDB:
Activity Spreadsheet -- Enzyme Inhibition Constant Data from BindingDB
Found 2 hits for monomerid = 50187236
TargetEstrogen receptor beta(Homo sapiens (Human))
Johnson & Johnson Pharmaceutical Research & Development
Curated by ChEMBL
LigandPNGBDBM50187236((S)-5-[4-(2-piperidin-1-yl-ethoxy)-phenyl]-5,11-di...)
Affinity DataIC50:  1.30nM. Assay description: Binding affinity to ERbeta
In DepthDetails ArticlePubMed
TargetEstrogen receptor(Homo sapiens (Human))
Johnson & Johnson Pharmaceutical Research & Development
Curated by ChEMBL
LigandPNGBDBM50187236((S)-5-[4-(2-piperidin-1-yl-ethoxy)-phenyl]-5,11-di...)
Affinity DataIC50:  0.610nM. Assay description: Binding affinity to ERalpha
In DepthDetails ArticlePubMed