BDBM50188432 CHEMBL219061::[4Aph(CO-NH-OCH3)5,D-4Aph(CO-NH-OCH3)6]degarelix
SMILES CONC(=O)Nc1ccc(C[C@H](NC(=O)[C@H](CO)NC(=O)[C@@H](Cc2cccnc2)NC(=O)[C@@H](Cc2ccc(Cl)cc2)NC(=O)[C@@H](Cc2ccc3ccccc3c2)NC(C)=O)C(=O)N[C@H](Cc2ccc(NC(=O)NOC)cc2)C(=O)N[C@@H](CC(C)C)C(=O)N[C@@H](CCCCNC(C)C)C(=O)N2CCC[C@H]2C(=O)N[C@H](C)C(N)=O)cc1
InChI Key InChIKey=MBXSPUXZEDANHS-KHEFCMSFSA-N
Data  1 IC50
  Tab Delimited (TSV)   2D SDfile   Computed 3D by Vconf -m prep SDfile
Find this compound or compounds like it in BindingDB:
Activity Spreadsheet -- Enzyme Inhibition Constant Data from BindingDB
Found 1 hit for monomerid = 50188432
TargetGonadotropin-releasing hormone receptor(Homo sapiens (Human))
Salk Institute
Curated by ChEMBL
LigandPNGBDBM50188432(CHEMBL219061 | [4Aph(CO-NH-OCH3)5,D-4Aph(CO-NH-OCH...)
Affinity DataIC50:  0.910nM. Assay description: Antagonist activity at human GnRH receptor expressed in HEK293 cells as inhibition of GnRH-induced LH secretion by reporter gene assay
In DepthDetails ArticlePubMed