BDBM50189225 (S)-1-(4-(2-(1-amino-3-methylbutyl)-4-(trifluoromethyl)phenyl)piperazin-1-yl)-3-(2,4,5-trimethoxyphenyl)propan-1-one::CHEMBL216009
SMILES COc1cc(OC)c(OC)cc1CCC(=O)N1CCN(CC1)c1ccc(cc1[C@@H](N)CC(C)C)C(F)(F)F
InChI Key InChIKey=LXNDVQBLBLFJSL-QFIPXVFZSA-N
Data  1 KI
  Tab Delimited (TSV)   2D SDfile   Computed 3D by Vconf -m prep SDfile
Find this compound or compounds like it in BindingDB:
Activity Spreadsheet -- Enzyme Inhibition Constant Data from BindingDB
Found 1 hit for monomerid = 50189225
TargetMelanocortin receptor 4(Homo sapiens (Human))
Neurocrine Biosciences
Curated by ChEMBL
LigandPNGBDBM50189225((S)-1-(4-(2-(1-amino-3-methylbutyl)-4-(trifluorome...)
Affinity DataKi:  6.10E+3nM. Assay description: Activity at MC4R assessed as inhibition of alpha-MSH-stimulated cAMP production
In DepthDetails ArticlePubMed