BDBM50190335 4-((3-chloro-4-hydroxyphenyl)diazenyl)benzenesulfonamide::CHEMBL215872
SMILES NS(=O)(=O)c1ccc(cc1)N=Nc1ccc(O)c(Cl)c1
InChI Key InChIKey=CNOMOEITTQLGJX-UHFFFAOYSA-N
Data  4 IC50
  Tab Delimited (TSV)   2D SDfile   Computed 3D by Vconf -m prep SDfile
Find this compound or compounds like it in BindingDB:
Activity Spreadsheet -- Enzyme Inhibition Constant Data from BindingDB
Found 4 hits for monomerid = 50190335
TargetProstaglandin G/H synthase 1(Homo sapiens (Human))
National Research Institute Of Chinese Medicine
Curated by ChEMBL
LigandPNGBDBM50190335(4-((3-chloro-4-hydroxyphenyl)diazenyl)benzenesulfo...)
Affinity DataIC50:  3.33E+4nM. Assay description: Inhibition of COX1 assessed as TBX2 production in human whole blood
In DepthDetails ArticlePubMed
TargetProstaglandin G/H synthase 2(Ovis aries (Sheep))
National Research Institute Of Chinese Medicine
Curated by ChEMBL
LigandPNGBDBM50190335(4-((3-chloro-4-hydroxyphenyl)diazenyl)benzenesulfo...)
Affinity DataIC50:  3.97E+4nM. Assay description: Inhibition of ovine COX2
In DepthDetails ArticlePubMed
TargetProstaglandin G/H synthase 2(Homo sapiens (Human))
National Research Institute Of Chinese Medicine
Curated by ChEMBL
LigandPNGBDBM50190335(4-((3-chloro-4-hydroxyphenyl)diazenyl)benzenesulfo...)
Affinity DataIC50:  1.13E+4nM. Assay description: Inhibition of COX2 assessed as LPS-stimulated PGE2 production in human whole blood leukocyte
In DepthDetails ArticlePubMed
TargetProstaglandin G/H synthase 1(Homo sapiens (Human))
National Research Institute Of Chinese Medicine
Curated by ChEMBL
LigandPNGBDBM50190335(4-((3-chloro-4-hydroxyphenyl)diazenyl)benzenesulfo...)
Affinity DataIC50:  4.05E+4nM. Assay description: Inhibition of ovine COX1
In DepthDetails ArticlePubMed