BDBM50192839 CHEMBL3984982
SMILES C[C@H]1Nc2cccnc2NC1=O
InChI Key InChIKey=XMOQIVFMYHKHRR-RXMQYKEDSA-N
Data  1 Kd
PDB links: 1 PDB ID matches this monomer.
  Tab Delimited (TSV)   2D SDfile   Computed 3D by Vconf -m prep SDfile
Find this compound or compounds like it in BindingDB:
Activity Spreadsheet -- Enzyme Inhibition Constant Data from BindingDB
Found 1 hit for monomerid = 50192839
TargetGlycogen synthase kinase-3 beta(Homo sapiens (Human))
Institute Of Harvard And Mit
Curated by ChEMBL
LigandPNGBDBM50192839(CHEMBL3984982)
Affinity DataKd:  6.00E+5nM. Assay description: Binding affinity to GSK-3 beta (unknown origin) after 30 mins by isothermal titration calorimetry