BDBM50195206 3-(5-((4-(aminomethyl)piperidin-1-yl)methyl)-1H-indol-2-yl)quinolin-2(1H)-one::3-(5-{[4-(AMINOMETHYL)PIPERIDIN-1-YL]METHYL}-1H-INDOL-2-YL)QUINOLIN-2(1H)-ONE::CHEMBL221735
SMILES NCC1CCN(Cc2ccc3[nH]c(cc3c2)-c2cc3ccccc3[nH]c2=O)CC1
InChI Key InChIKey=KBIHHEGEALBUMT-UHFFFAOYSA-N
Data  1 IC50
PDB links: 1 PDB ID matches this monomer.
  Tab Delimited (TSV)   2D SDfile   Computed 3D by Vconf -m prep SDfile
Find this compound or compounds like it in BindingDB:
Activity Spreadsheet -- Enzyme Inhibition Constant Data from BindingDB
Found 1 hit for monomerid = 50195206
TargetSerine/threonine-protein kinase Chk1(Homo sapiens (Human))
Merck Research Laboratories
Curated by ChEMBL
LigandPNGBDBM50195206(3-(5-((4-(aminomethyl)piperidin-1-yl)methyl)-1H-in...)
Affinity DataIC50:  140nM. Assay description: Inhibition of human CHEK1