BDBM50199317 CHEMBL214525::N-ethyloxycarbonyl-2-(4-imidazol-1-ylmethylphenyl)-4-butylbenzenesulfonamide
SMILES CCCCc1ccc(c(c1)-c1ccc(Cn2ccnc2)cc1)S(=O)(=O)NC(=O)OCC
InChI Key InChIKey=HSUCPDJVRZPITM-UHFFFAOYSA-N
Data  2 KI
  Tab Delimited (TSV)   2D SDfile   Computed 3D by Vconf -m prep SDfile
Find this compound or compounds like it in BindingDB:
Activity Spreadsheet -- Enzyme Inhibition Constant Data from BindingDB
Found 2 hits for monomerid = 50199317
TargetType-2 angiotensin II receptor(Homo sapiens (Human))
Uppsala University
Curated by ChEMBL
LigandPNGBDBM50199317(CHEMBL214525 | N-ethyloxycarbonyl-2-(4-imidazol-1-...)
Affinity DataKi:  2nM. Assay description: Displacement of [125I]Ang2 from AT2 receptor in pig uterus membrane
In DepthDetails ArticlePubMed
TargetType-2 angiotensin II receptor(RAT)
Uppsala University
Curated by ChEMBL
LigandPNGBDBM50199317(CHEMBL214525 | N-ethyloxycarbonyl-2-(4-imidazol-1-...)
Affinity DataKi: >1.00E+4nM. Assay description: Displacement of [125I]Ang2 from AT2 receptor in rat liver membrane
In DepthDetails ArticlePubMed