BDBM50202441 CHEMBL3263914
SMILES CCCCn1cc(\C=C2/Oc3cc(O)cc(O)c3C2=O)c2cccc(C)c12
InChI Key InChIKey=DAJKIRPDVOVALH-OCKHKDLRSA-N
Data  1 IC50
  Tab Delimited (TSV)   2D SDfile   Computed 3D by Vconf -m prep SDfile
Find this compound or compounds like it in BindingDB:
Activity Spreadsheet -- Enzyme Inhibition Constant Data from BindingDB
Found 1 hit for monomerid = 50202441
TargetATP-binding cassette sub-family C member 2(Homo sapiens (Human))
Bmssi Umr 5086 Cnrs/Universit£
Curated by ChEMBL
LigandPNGBDBM50202441(CHEMBL3263914)
Affinity DataIC50:  4.50E+3nM. Assay description: Inhibition of ABCC2 (unknown origin) expressed in MDCK2 cells assessed as inhibition of calcein-AM efflux measured after 30 mins in presence of ABCB1...
In DepthDetails ArticlePubMed