BDBM50204046 CHEMBL3911925
SMILES [H][C@@]12COc3c(F)ccc(F)c3[C@@]1(CCO[C@H]2CCS(=O)(=O)C[C@@H]1CCCN1)S(=O)(=O)c1ccc(Cl)cc1
InChI Key InChIKey=HJFUEOSIZHFJQY-JNLMMFOCSA-N
Data  4 IC50
  Tab Delimited (TSV)   2D SDfile   Computed 3D by Vconf -m prep SDfile
Find this compound or compounds like it in BindingDB:
Activity Spreadsheet -- Enzyme Inhibition Constant Data from BindingDB
Found 4 hits for monomerid = 50204046
TargetCytochrome P450 2D6(Homo sapiens (Human))
Merck Research Laboratories
Curated by ChEMBL
LigandPNGBDBM50204046(CHEMBL3911925)
Affinity DataIC50: >2.00E+4nM. Assay description: Inhibition of CYP2D6 in human liver microsomes after 30 secs by LC/MS/MS analysis
In DepthDetails ArticlePubMed
TargetCytochrome P450 2C9(Homo sapiens (Human))
Merck Research Laboratories
Curated by ChEMBL
LigandPNGBDBM50204046(CHEMBL3911925)
Affinity DataIC50: >2.00E+4nM. Assay description: Inhibition of CYP2C9 in human liver microsomes after 30 secs by LC/MS/MS analysis
In DepthDetails ArticlePubMed
TargetCytochrome P450 3A4(Homo sapiens (Human))
Merck Research Laboratories
Curated by ChEMBL
LigandPNGBDBM50204046(CHEMBL3911925)
Affinity DataIC50: >2.00E+4nM. Assay description: Inhibition of CYP3A4 in human liver microsomes after 30 secs by LC/MS/MS analysis
In DepthDetails ArticlePubMed
TargetCytochrome P450 3A4(Homo sapiens (Human))
Merck Research Laboratories
Curated by ChEMBL
LigandPNGBDBM50204046(CHEMBL3911925)
Affinity DataIC50:  1.00E+3nM. Assay description: Inhibition of CYP3A4 in human liver microsomes preincubated for 30 mins after 30 secs by LC/MS/MS analysis
In DepthDetails ArticlePubMed