BDBM50206657 CHEMBL230310::N-(1-(3-amino-3-(4-methoxyphenyl)propanoyl)piperidin-4-yl)-N-phenylpropionamide
SMILES CCC(=O)N(C1CCN(CC1)C(=O)CC(N)c1ccc(OC)cc1)c1ccccc1
InChI Key InChIKey=QCXLPRYYFORIOD-UHFFFAOYSA-N
Data  2 KI
  Tab Delimited (TSV)   2D SDfile   Computed 3D by Vconf -m prep SDfile
Find this compound or compounds like it in BindingDB:
Activity Spreadsheet -- Enzyme Inhibition Constant Data from BindingDB
Found 2 hits for monomerid = 50206657
TargetDelta-type opioid receptor(Homo sapiens (Human))
University Of Arizona
Curated by ChEMBL
LigandPNGBDBM50206657(CHEMBL230310 | N-(1-(3-amino-3-(4-methoxyphenyl)pr...)
Affinity DataKi:  9.00E+3nM. Assay description: Displacement of [3H]DPDPE from human delta opioid receptor transfected in HN9.10 cells
In DepthDetails ArticlePubMed
TargetMu-type opioid receptor(Rattus norvegicus (rat))
University Of Arizona
Curated by ChEMBL
LigandPNGBDBM50206657(CHEMBL230310 | N-(1-(3-amino-3-(4-methoxyphenyl)pr...)
Affinity DataKi:  9.70E+3nM. Assay description: Displacement of [3H] DAMGO from rat mu opioid receptor transfected in HN9.10 cells
In DepthDetails ArticlePubMed