BDBM50210157 CHEMBL3883790
SMILES COc1ccc(F)c(c1)-c1ccc(nc1)C1CCc2ccc(cc2O1)[C@@H](CC(O)=O)C1CC1
InChI Key InChIKey=GKBPGYZQAFOWNL-BWDMCYIDSA-N
Data  2 EC50
  Tab Delimited (TSV)   2D SDfile   Computed 3D by Vconf -m prep SDfile
Find this compound or compounds like it in BindingDB:
Activity Spreadsheet -- Enzyme Inhibition Constant Data from BindingDB
Found 2 hits for monomerid = 50210157
TargetFree fatty acid receptor 1(Homo sapiens (Human))
Merck Research Laboratories
Curated by ChEMBL
LigandPNGBDBM50210157(CHEMBL3883790)
Affinity DataEC50:  2.53E+3nM. Assay description: Positive allosteric modulation of human GPR40 expressed in HEK293 cells assessed as IP1 accumulation measured after 60 mins in presence of 100% human...
In DepthDetails ArticlePubMed
TargetFree fatty acid receptor 1(Homo sapiens (Human))
Merck Research Laboratories
Curated by ChEMBL
LigandPNGBDBM50210157(CHEMBL3883790)
Affinity DataEC50:  16nM. Assay description: Positive allosteric modulation of human GPR40 expressed in HEK293 cells assessed as IP1 accumulation measured after 60 mins by HTRF assay
In DepthDetails ArticlePubMed