BDBM50211318 3-chloro-2-fluoro-N-((1r,4r)-4-(4-(2-isopropoxyphenyl)piperazin-1-yl)cyclohexyl)benzenesulfonamide::CHEMBL393105
SMILES CC(C)Oc1ccccc1N1CCN(CC1)[C@H]1CC[C@@H](CC1)NS(=O)(=O)c1cccc(Cl)c1F
InChI Key InChIKey=JOQJONDKZULBPP-MXVIHJGJSA-N
Data  4 KI
  Tab Delimited (TSV)   2D SDfile   Computed 3D by Vconf -m prep SDfile
Find this compound or compounds like it in BindingDB:
Activity Spreadsheet -- Enzyme Inhibition Constant Data from BindingDB
Found 4 hits for monomerid = 50211318
TargetAlpha-1A adrenergic receptor(Homo sapiens (Human))
Johnson & Johnson Pharmaceutical Research And Development
Curated by ChEMBL
LigandPNGBDBM50211318(3-chloro-2-fluoro-N-((1r,4r)-4-(4-(2-isopropoxyphe...)
Affinity DataKi:  0.560nM. Assay description: Binding affinity to human cloned adrenergic alpha1A receptor
In DepthDetails ArticlePubMed
TargetAlpha-1D adrenergic receptor(Homo sapiens (Human))
Johnson & Johnson Pharmaceutical Research And Development
Curated by ChEMBL
LigandPNGBDBM50211318(3-chloro-2-fluoro-N-((1r,4r)-4-(4-(2-isopropoxyphe...)
Affinity DataKi:  24nM. Assay description: Binding affinity to human cloned adrenergic alpha1D receptor
In DepthDetails ArticlePubMed
TargetD(2) dopamine receptor(Homo sapiens (Human))
Johnson & Johnson Pharmaceutical Research And Development
Curated by ChEMBL
LigandPNGBDBM50211318(3-chloro-2-fluoro-N-((1r,4r)-4-(4-(2-isopropoxyphe...)
Affinity DataKi:  271nM. Assay description: Binding affinity to human dopamine D2 receptor
In DepthDetails ArticlePubMed
TargetAlpha-1B adrenergic receptor(Homo sapiens (Human))
Johnson & Johnson Pharmaceutical Research And Development
Curated by ChEMBL
LigandPNGBDBM50211318(3-chloro-2-fluoro-N-((1r,4r)-4-(4-(2-isopropoxyphe...)
Affinity DataKi:  348nM. Assay description: Binding affinity to human cloned adrenergic alpha1B receptor
In DepthDetails ArticlePubMed