BDBM50214703 1-{4-[(1R)-2-(amino-3-methylbutyl)-6-fluorophenyl]-4-[(2R)-(3-aminopropionylamido)-3-(2,4-dichlorophenyl)propionyl]}-piperazine::CHEMBL236015
SMILES CC(C)C[C@@H](N)c1cccc(F)c1N1CCN(CC1)C(=O)[C@@H](Cc1ccc(Cl)cc1Cl)NC(=O)CCN
InChI Key InChIKey=AEZCRBIFPKXUGD-DNQXCXABSA-N
Data  1 KI
  Tab Delimited (TSV)   2D SDfile   Computed 3D by Vconf -m prep SDfile
Find this compound or compounds like it in BindingDB:
Activity Spreadsheet -- Enzyme Inhibition Constant Data from BindingDB
Found 1 hit for monomerid = 50214703
TargetMelanocortin receptor 4(Homo sapiens (Human))
Neurocrine Biosciences
Curated by ChEMBL
LigandPNGBDBM50214703(1-{4-[(1R)-2-(amino-3-methylbutyl)-6-fluorophenyl]...)
Affinity DataKi:  2.30nM. Assay description: Displacement of [125I]NDP-MSH from MC4R receptor in HEK293 cells
In DepthDetails ArticlePubMed