BDBM50216355 CHEMBL318925
SMILES [H][C@]12CCc3c(OS(C)(=O)=O)cccc3[C@]1([H])CCCN2CCCCNC(=O)c1ccc(cc1)-c1ccccc1
InChI Key InChIKey=PRDRZXROMYANHC-YTMVLYRLSA-N
Data  2 KI
  Tab Delimited (TSV)   2D SDfile   Computed 3D by Vconf -m prep SDfile
Find this compound or compounds like it in BindingDB:
Activity Spreadsheet -- Enzyme Inhibition Constant Data from BindingDB
Found 2 hits for monomerid = 50216355
TargetD(3) dopamine receptor(Homo sapiens (Human))
Smithkline Beecham Pharmaceuticals
Curated by ChEMBL
LigandPNGBDBM50216355(CHEMBL318925)
Affinity DataKi:  6.30nM. Assay description: Binding affinity at Dopamine receptor D3 expressed in CHO cells by [125I]iodosulpiride displacement.
In DepthDetails ArticlePubMed
TargetD(2) dopamine receptor(Homo sapiens (Human))
Smithkline Beecham Pharmaceuticals
Curated by ChEMBL
LigandPNGBDBM50216355(CHEMBL318925)
Affinity DataKi:  251nM. Assay description: Binding affinity at Dopamine receptor D2 expressed in CHO cells by [125I]iodosulpiride displacement.
In DepthDetails ArticlePubMed