BDBM50219303 CHEMBL345893
SMILES Cc1c(COc2ccc(F)cc2F)oc2cccc(OCCCNCc3cccnc3)c12
InChI Key InChIKey=CBKBXWFRVHPWBU-UHFFFAOYSA-N
Data  3 IC50
  Tab Delimited (TSV)   2D SDfile   Computed 3D by Vconf -m prep SDfile
Find this compound or compounds like it in BindingDB:
Activity Spreadsheet -- Enzyme Inhibition Constant Data from BindingDB
Found 3 hits for monomerid = 50219303
TargetGlycylpeptide N-tetradecanoyltransferase 1/2(Homo sapiens (Human))
Nippon Roche Research Center
Curated by ChEMBL
LigandPNGBDBM50219303(CHEMBL345893)
Affinity DataIC50:  3.70nM. Assay description: Inhibitory activity against Candida albicans (Nmt) assessed as inhibitory concentration (nM)
In DepthDetails ArticlePubMed
TargetGlycylpeptide N-tetradecanoyltransferase 1/2(Homo sapiens (Human))
Nippon Roche Research Center
Curated by ChEMBL
LigandPNGBDBM50219303(CHEMBL345893)
Affinity DataIC50:  7.5nM. Assay description: Inhibitory activity against Candida albicans N-Myristoyltransferase (CaNmt) assessed as inhibitory concentration using substrate peptide and myristot...
In DepthDetails ArticlePubMed
TargetGlycylpeptide N-tetradecanoyltransferase 1/2(Homo sapiens (Human))
Nippon Roche Research Center
Curated by ChEMBL
LigandPNGBDBM50219303(CHEMBL345893)
Affinity DataIC50: >4.50E+5nM. Assay description: Inhibitory activity against human N-Myristoyltransferase (HsNmt) assessed as inhibitory concentration using substrate peptide and myristotyl-CoA at 0...
In DepthDetails ArticlePubMed