BDBM50219698 4-(6-(dimethylamino)pyrimidin-4-ylamino)-N-(3-(4-fluoro-3-(trifluoromethyl)phenyl)-1,2,4-thiadiazol-5-yl)benzamide::CHEMBL247240
SMILES CN(C)c1cc(Nc2ccc(cc2)C(=O)Nc2nc(ns2)-c2ccc(F)c(c2)C(F)(F)F)ncn1
InChI Key InChIKey=ZOTXREFTVLTGPQ-UHFFFAOYSA-N
Data  1 EC50
  Tab Delimited (TSV)   2D SDfile   Computed 3D by Vconf -m prep SDfile
Find this compound or compounds like it in BindingDB:
Activity Spreadsheet -- Enzyme Inhibition Constant Data from BindingDB
Found 1 hit for monomerid = 50219698
TargetThrombopoietin receptor(Homo sapiens (Human))
Pfizer
Curated by ChEMBL
LigandPNGBDBM50219698(4-(6-(dimethylamino)pyrimidin-4-ylamino)-N-(3-(4-f...)
Affinity DataEC50:  43nM. Assay description: Agonist activity at human TPOr expressed in BaF3 cells by reporter assay
In DepthDetails ArticlePubMed