BDBM50220568 CHEMBL368134
SMILES Cc1c(oc2cccc(OCCCNCc3cccnc3)c12)C(=O)c1ccco1
InChI Key InChIKey=RUYYBFFHEKQIGW-UHFFFAOYSA-N
Data  3 IC50
  Tab Delimited (TSV)   2D SDfile   Computed 3D by Vconf -m prep SDfile
Find this compound or compounds like it in BindingDB:
Activity Spreadsheet -- Enzyme Inhibition Constant Data from BindingDB
Found 3 hits for monomerid = 50220568
TargetGlycylpeptide N-tetradecanoyltransferase 1/2(Homo sapiens (Human))
Nippon Roche Research Center
Curated by ChEMBL
LigandPNGBDBM50220568(CHEMBL368134)
Affinity DataIC50:  1.40E+3nM. Assay description: In vitro inhibitory activity against Candida albicans Nmt (CaNmt) using substrate peptide GLTISKLFR-R-NH2 (0.5 uM) and myristoyl-CoA (0.5 uM)
In DepthDetails ArticlePubMed
TargetGlycylpeptide N-tetradecanoyltransferase 1/2(Homo sapiens (Human))
Nippon Roche Research Center
Curated by ChEMBL
LigandPNGBDBM50220568(CHEMBL368134)
Affinity DataIC50:  2.80E+5nM. Assay description: In vitro inhibitory activity against human Nmt (HsNmt) using 0.5 uM peptide GNAASAR-R-NH2 and 0.5 uM myristoyl-CoA
In DepthDetails ArticlePubMed
TargetGlycylpeptide N-tetradecanoyltransferase 1/2(Homo sapiens (Human))
Nippon Roche Research Center
Curated by ChEMBL
LigandPNGBDBM50220568(CHEMBL368134)
Affinity DataIC50:  1.50E+5nM. Assay description: In vitro inhibitory activity against Aspergillus fumigatus Nmt (AfNmt) using substrate peptide GLTISKLFR-R-NH2 (0.5 uM) and myristoyl-CoA (0.5 uM)
In DepthDetails ArticlePubMed