BDBM50228931 CHEMBL321221
SMILES OC(=O)[C@@H]1Cc2c(CN1C(=O)C(c1ccccc1)c1ccccc1)ncn2C(c1ccccc1)c1ccccc1
InChI Key InChIKey=RUIVHQNVXDCNFO-PMERELPUSA-N
Data  1 IC50
  Tab Delimited (TSV)   2D SDfile   Computed 3D by Vconf -m prep SDfile
Find this compound or compounds like it in BindingDB:
Activity Spreadsheet -- Enzyme Inhibition Constant Data from BindingDB
Found 1 hit for monomerid = 50228931
LigandPNGBDBM50228931(CHEMBL321221)
Affinity DataIC50:  110nM. Assay description: Binding affinity against Angiotensin II receptor, from rat adrenal gland
In DepthDetails ArticlePubMed