BDBM50230334 CHEMBL4086754
SMILES COC(=O)Nc1ccc2-c3c[nH]c(n3)[C@H](CCCCCCCc2c1)NC(=O)\C=C\c1cc(Cl)ccc1-n1cnnn1
InChI Key InChIKey=LFMFTLSGZCPRTD-WXQAMHPUSA-N
Data  1 KI
  Tab Delimited (TSV)   2D SDfile   Computed 3D by Vconf -m prep SDfile
Find this compound or compounds like it in BindingDB:
Activity Spreadsheet -- Enzyme Inhibition Constant Data from BindingDB
Found 1 hit for monomerid = 50230334
TargetCoagulation factor XI(Homo sapiens (Human))
Bristol-Myers Squibb
Curated by ChEMBL
LigandPNGBDBM50230334(CHEMBL4086754)
Affinity DataKi:  600nM. Assay description: Inhibition of human coagulation factor 11a using pyroGlu-Pro-Arg-pNA as substrate after 10 to 120 mins at 37 degC by spectrophotometric method
In DepthDetails ArticlePubMed