BDBM50234105 CHEMBL4095318
SMILES OC(=O)[C@@H]1C[C@H](CN1)Oc1c(ccc2ccccc12)C(O)=O
InChI Key InChIKey=AMSPZKSXSPYIAJ-MFKMUULPSA-N
Data  4 KI
  Tab Delimited (TSV)   2D SDfile   Computed 3D by Vconf -m prep SDfile
Find this compound or compounds like it in BindingDB:
Activity Spreadsheet -- Enzyme Inhibition Constant Data from BindingDB
Found 4 hits for monomerid = 50234105
TargetGlutamate receptor ionotropic, kainate 3(Rattus norvegicus)
Mcgill University
Curated by ChEMBL
LigandPNGBDBM50234105(CHEMBL4095318)
Affinity DataKi: >1.00E+5nM. Assay description: Displacement of [3H]kainic acid from eGFP-fused recombinant rat full length GluK3 receptor expressed in HEK293T/17 cells by liquid scintillation coun...
In DepthDetails ArticlePubMed
TargetGlutamate receptor ionotropic, kainate 2(Rattus norvegicus)
Mcgill University
Curated by ChEMBL
LigandPNGBDBM50234105(CHEMBL4095318)
Affinity DataKi: >1.00E+5nM. Assay description: Displacement of [3H]kainic acid from eGFP-fused recombinant rat full length GluK2 receptor expressed in HEK293T/17 cells by liquid scintillation coun...
In DepthDetails ArticlePubMed
TargetGlutamate receptor 2(Rattus norvegicus)
Mcgill University
Curated by ChEMBL
LigandPNGBDBM50234105(CHEMBL4095318)
Affinity DataKi: >1.00E+5nM. Assay description: Displacement of (RS)-[3H]AMPA from eGFP-fused recombinant rat full length GluA2 receptor expressed in HEK293T/17 cells by liquid scintillation counti...
In DepthDetails ArticlePubMed
TargetGlutamate receptor ionotropic, kainate 1(RAT)
Mcgill University
Curated by ChEMBL
LigandPNGBDBM50234105(CHEMBL4095318)
Affinity DataKi: >1.00E+5nM. Assay description: Displacement of [3H]NF608 from eGFP-fused recombinant rat full length GluK1 receptor expressed in HEK293T/17 cells by liquid scintillation counting m...
In DepthDetails ArticlePubMed