BDBM50234165 CHEMBL4090281
SMILES C[C@H](N1CCOCC1)c1nc(nn1C)-c1cnc(N)c(n1)-n1nnc2ccccc12
InChI Key InChIKey=FXHVFSHZRDKMCE-LBPRGKRZSA-N
Data  4 IC50
PDB links: 2 PDB IDs match this monomer.
  Tab Delimited (TSV)   2D SDfile   Computed 3D by Vconf -m prep SDfile
Find this compound or compounds like it in BindingDB:
Activity Spreadsheet -- Enzyme Inhibition Constant Data from BindingDB
Found 4 hits for monomerid = 50234165
LigandPNGBDBM50234165(CHEMBL4090281)
Affinity DataIC50:  1.26E+3nM. Assay description: Inhibition of recombinant human His6-tagged PI3K p110alpha/p85alpha using DiC8-PIP2 as substrate preincubated for 15 mins followed by substrate addit...
In DepthDetails ArticlePubMed
LigandPNGBDBM50234165(CHEMBL4090281)
Affinity DataIC50:  3.98E+3nM. Assay description: Inhibition of recombinant human His6-tagged PI3K p110beta/p85alpha using DiC8-PIP2 as substrate preincubated for 15 mins followed by substrate additi...
In DepthDetails ArticlePubMed
LigandPNGBDBM50234165(CHEMBL4090281)
Affinity DataIC50:  1.59E+3nM. Assay description: Inhibition of recombinant human His6-tagged PI3Kgamma (144 to 1102 residues) using DiC8-PIP2 as substrate preincubated for 15 mins followed by substr...
LigandPNGBDBM50234165(CHEMBL4090281)
Affinity DataIC50:  79nM. Assay description: Inhibition of recombinant human His6-tagged PI3K p110delta/p85alpha using DiC8-PIP2 as substrate preincubated for 15 mins followed by substrate addit...