BDBM50234200 CHEMBL4094630
SMILES Cc1cccc(c1)-c1cc(Cl)ccc1[C@@H](Oc1cc(nc(N)n1)N1CCC2(CN[C@@H](C2)C(O)=O)CC1)C(F)(F)F
InChI Key InChIKey=LSMOJVXUVGVNPC-XUZZJYLKSA-N
Data  1 IC50
  Tab Delimited (TSV)   2D SDfile   Computed 3D by Vconf -m prep SDfile
Find this compound or compounds like it in BindingDB:
Activity Spreadsheet -- Enzyme Inhibition Constant Data from BindingDB
Found 1 hit for monomerid = 50234200
TargetTryptophan 5-hydroxylase 1(Homo sapiens (Human))
Karos Pharmaceuticals
Curated by ChEMBL
LigandPNGBDBM50234200(CHEMBL4094630)
Affinity DataIC50:  26nM. Assay description: Inhibition of TPH1 (unknown origin)
In DepthDetails ArticlePubMed