BDBM50240229 CHEMBL4084182
SMILES Fc1ccc(OCCCNC(=N)Nc2ccc(Cl)cc2)cc1
InChI Key InChIKey=YIXQZLPGNXXTFM-UHFFFAOYSA-N
Data  1 KI  2 IC50  1 EC50
  Tab Delimited (TSV)   2D SDfile   Computed 3D by Vconf -m prep SDfile
Find this compound or compounds like it in BindingDB:
Activity Spreadsheet -- Enzyme Inhibition Constant Data from BindingDB
Found 4 hits for monomerid = 50240229
TargetSigma non-opioid intracellular receptor 1(Homo sapiens (Human))
Drexel University College of Medicine
Curated by ChEMBL
LigandPNGBDBM50240229(CHEMBL4084182)
Affinity DataKi:  38nM. Assay description: Displacement of [3H]-(+)-pentazocine from sigma1 in human MDA-MB-468 cell membranes
In DepthDetails ArticlePubMed
TargetPotassium voltage-gated channel subfamily H member 2(Homo sapiens (Human))
Drexel University College of Medicine
Curated by ChEMBL
LigandPNGBDBM50240229(CHEMBL4084182)
Affinity DataIC50:  430nM. Assay description: Inhibition of human ERG expressed in CHOK1 cells by Qpatch clamp method
In DepthDetails ArticlePubMed
TargetAndrogen receptor(Homo sapiens (Human))
Drexel University College of Medicine
Curated by ChEMBL
LigandPNGBDBM50240229(CHEMBL4084182)
Affinity DataEC50:  1.27E+4nM. Assay description: Antagonist activity at full length human androgen receptor expressed in mammalian expression system measured after 22 to 24 hrs by luciferase reporte...
In DepthDetails ArticlePubMed
TargetPotassium voltage-gated channel subfamily H member 2(Homo sapiens (Human))
Drexel University College of Medicine
Curated by ChEMBL
LigandPNGBDBM50240229(CHEMBL4084182)
Affinity DataIC50:  216nM. Assay description: Inhibition of human ERG
In DepthDetails ArticlePubMed