BDBM50240910 CHEMBL4104501
SMILES COc1ccc(CC2SC(=O)NC2=O)c(OC)c1
InChI Key InChIKey=KGQRHOMYUSKNBZ-UHFFFAOYSA-N
Data  3 Kd
PDB links: 1 PDB ID matches this monomer.
  Tab Delimited (TSV)   2D SDfile   Computed 3D by Vconf -m prep SDfile
Find this compound or compounds like it in BindingDB:
Activity Spreadsheet -- Enzyme Inhibition Constant Data from BindingDB
Found 3 hits for monomerid = 50240910
TargetCarbonic anhydrase 2(Homo sapiens (Human))
Griffith University
Curated by ChEMBL
LigandPNGBDBM50240910(CHEMBL4104501)
Affinity DataKd:  1.60E+4nM. Assay description: Binding affinity to human carbonic anhydrase 2 at +10 charge state for protein to compound complex after 10 mins by nanoESI-MS method
TargetCarbonic anhydrase 2(Homo sapiens (Human))
Griffith University
Curated by ChEMBL
LigandPNGBDBM50240910(CHEMBL4104501)
Affinity DataKd:  2.62E+4nM. Assay description: Binding affinity to human carbonic anhydrase 2 by surface plasmon resonance spectrometry
TargetCarbonic anhydrase 2(Homo sapiens (Human))
Griffith University
Curated by ChEMBL
LigandPNGBDBM50240910(CHEMBL4104501)
Affinity DataKd:  1.39E+4nM. Assay description: Binding affinity to human carbonic anhydrase 2 at +9, +10 and +11 charge states for protein to compound complex after 10 mins by nanoESI-MS method