BDBM50241598 CHEMBL4063503
SMILES OB(O)c1ccc(\C=C\c2cc(O)cc(O)c2)cc1
InChI Key InChIKey=DYVLARRBNBVUFX-OWOJBTEDSA-N
Data  1 Kd
PDB links: 1 PDB ID matches this monomer.
  Tab Delimited (TSV)   2D SDfile   Computed 3D by Vconf -m prep SDfile
Find this compound or compounds like it in BindingDB:
Activity Spreadsheet -- Enzyme Inhibition Constant Data from BindingDB
Found 1 hit for monomerid = 50241598
TargetTransthyretin(Homo sapiens (Human))
University Of Wisconsin-Madison
Curated by ChEMBL
LigandPNGBDBM50241598(CHEMBL4063503)
Affinity DataKd:  470nM. Assay description: Competitive binding affinity to human wild type TTR expressed in Escherichia coli BL-21 assessed as equilibrium dissociation constant of second site ...