BDBM50246883 CHEMBL4069230
SMILES CC(=O)Nc1ccc(cc1)S(=O)(=O)Nc1ccc(Oc2ccc3ccccc3c2)cc1
InChI Key InChIKey=YYGHDFIKAKVWFF-UHFFFAOYSA-N
Data  1 IC50
PDB links: 1 PDB ID matches this monomer.
  Tab Delimited (TSV)   2D SDfile   Computed 3D by Vconf -m prep SDfile
Find this compound or compounds like it in BindingDB:
Activity Spreadsheet -- Enzyme Inhibition Constant Data from BindingDB
Found 1 hit for monomerid = 50246883
TargetPlatelet-activating factor acetylhydrolase(Homo sapiens (Human))
Shanghaitech University
Curated by ChEMBL
LigandPNGBDBM50246883(CHEMBL4069230)
Affinity DataIC50:  3.43E+3nM. Assay description: Inhibition of human recombinant GST-tagged Lp-PLA2 (47 to 429 residues) expressed in Escherichia coli Rosetta(DE3) pLysS using 2-thio-PAF as substrat...