BDBM50247640 CHEMBL4063356
SMILES CCOC(=O)c1c(oc2ccc(O)c(CN3CCC(C)CC3)c12)-c1ccccc1
InChI Key InChIKey=YDARBKORYFGQMH-UHFFFAOYSA-N
Data  1 IC50
PDB links: 1 PDB ID matches this monomer.
  Tab Delimited (TSV)   2D SDfile   Computed 3D by Vconf -m prep SDfile
Find this compound or compounds like it in BindingDB:
Activity Spreadsheet -- Enzyme Inhibition Constant Data from BindingDB
Found 1 hit for monomerid = 50247640
TargetPolyketide synthase Pks13(Mycobacterium tuberculosis (strain ATCC 25618 / H3...)
Rheinische Friedrich-Wilhelms-Universit£T
Curated by ChEMBL
LigandPNGBDBM50247640(CHEMBL4063356)
Affinity DataIC50:  260nM. Assay description: Inhibition of Mycobacterium tuberculosis ATCC 25618 H37Rv Pks13 thioesterase domain expressed in Escherichia coli BL21(DE3) using 4-MUH as substrate ...