BDBM50247702 2-[1'-Phenyl-3'-(3,4-dimethoxyphenyl)-2'-propenylidene]hydrazine-3-methyl-4(3H)-quinazolinone::CHEMBL455181
SMILES COc1ccc(CC=C(N=Nc2nc3ccccc3c(=O)n2C)c2ccccc2)cc1OC
InChI Key InChIKey=ZNPRRQSLUHGCST-UHFFFAOYSA-N
Data  2 KI  2 IC50
  Tab Delimited (TSV)   2D SDfile   Computed 3D by Vconf -m prep SDfile
Find this compound or compounds like it in BindingDB:
Activity Spreadsheet -- Enzyme Inhibition Constant Data from BindingDB
Found 4 hits for monomerid = 50247702
TargetAmine oxidase [flavin-containing] B(Rattus norvegicus (rat))
Hacettepe University
Curated by ChEMBL
LigandPNGBDBM50247702(2-[1'-Phenyl-3'-(3,4-dimethoxyphenyl)-2'-propenyli...)
Affinity DataKi:  6.51E+4nM. Assay description: Inhibition of MAO-B in rat liver homogenate after 60 mins by Lineweaver-Burk plot
In DepthDetails ArticlePubMed
TargetAmine oxidase [flavin-containing] A(Rattus norvegicus (rat))
Hacettepe University
Curated by ChEMBL
LigandPNGBDBM50247702(2-[1'-Phenyl-3'-(3,4-dimethoxyphenyl)-2'-propenyli...)
Affinity DataKi:  9.07E+4nM. Assay description: Inhibition of MAO-A in rat liver homogenate after 60 mins by Lineweaver-Burk plot
In DepthDetails ArticlePubMed
TargetAmine oxidase [flavin-containing] B(Rattus norvegicus (rat))
Hacettepe University
Curated by ChEMBL
LigandPNGBDBM50247702(2-[1'-Phenyl-3'-(3,4-dimethoxyphenyl)-2'-propenyli...)
Affinity DataIC50:  4.71E+5nM. Assay description: Inhibition of MAO-B in rat liver homogenate after 60 mins by residual activity plot
In DepthDetails ArticlePubMed
TargetAmine oxidase [flavin-containing] A(Rattus norvegicus (rat))
Hacettepe University
Curated by ChEMBL
LigandPNGBDBM50247702(2-[1'-Phenyl-3'-(3,4-dimethoxyphenyl)-2'-propenyli...)
Affinity DataIC50:  6.80E+4nM. Assay description: Inhibition of MAO-A in rat liver homogenate after 60 mins by residual activity plot
In DepthDetails ArticlePubMed