BDBM50248919 (S)-N-(2-(1-(3-ethoxy-4-methoxyphenyl)-2-(methylsulfonyl)ethyl)-1,3-dioxoisoindolin-4-yl)acetamide::APREMILAST::CHEMBL514800::US10662189, Compound Apremilast
SMILES CCOc1cc(ccc1OC)[C@@H](CS(C)(=O)=O)N1C(=O)c2cccc(NC(C)=O)c2C1=O
InChI Key InChIKey=IMOZEMNVLZVGJZ-QGZVFWFLSA-N
Data  17 IC50
PDB links: 1 PDB ID matches this monomer.
  Tab Delimited (TSV)   2D SDfile   Computed 3D by Vconf -m prep SDfile
Find this compound or compounds like it in BindingDB:
Activity Spreadsheet -- Enzyme Inhibition Constant Data from BindingDB
Found 1 hit for monomerid = 50248919
TargetcAMP-specific 3',5'-cyclic phosphodiesterase 4D(Homo sapiens (Human))
Guangzhou University Of Chinese Medicine
Curated by ChEMBL
LigandPNGBDBM50248919((S)-N-(2-(1-(3-ethoxy-4-methoxyphenyl)-2-(methylsu...)
Affinity DataIC50:  540nM. Assay description: Inhibition of PDE4D2 (unknown origin)