BDBM50249042 CHEMBL4087272
SMILES COC(=O)c1ccc2[nH]c(=O)oc2c1
InChI Key InChIKey=FUJBKRLYHYJMNF-UHFFFAOYSA-N
Data  1 IC50  1 Kd
PDB links: 1 PDB ID matches this monomer.
  Tab Delimited (TSV)   2D SDfile   Computed 3D by Vconf -m prep SDfile
Find this compound or compounds like it in BindingDB:
Activity Spreadsheet -- Enzyme Inhibition Constant Data from BindingDB
Found 2 hits for monomerid = 50249042
TargetCREB-binding protein(Homo sapiens (Human))
University of Z£Rich
Curated by ChEMBL
LigandPNGBDBM50249042(CHEMBL4087272)
Affinity DataIC50:  4.55E+5nM. Assay description: Inhibition of histone H4 tetraacetylated peptide binding to human CBP by Alphascreen assay
TargetCREB-binding protein(Homo sapiens (Human))
University of Z£Rich
Curated by ChEMBL
LigandPNGBDBM50249042(CHEMBL4087272)
Affinity DataKd:  8.50E+4nM. Assay description: Binding affinity to partial length human DNA-tagged CBP (R1081 to G1197 residues) expressed in bacterial expression system by qPCR analysis