BDBM50250569 CHEMBL4084484
SMILES CN(C)CCCc1cc(CCc2cc(C)cc(N)n2)cc(c1)C(F)(F)F
InChI Key InChIKey=CTKGSJUPWJLHAK-UHFFFAOYSA-N
Data  2 KI
PDB links: 2 PDB IDs match this monomer.
  Tab Delimited (TSV)   2D SDfile   Computed 3D by Vconf -m prep SDfile
Find this compound or compounds like it in BindingDB:
Activity Spreadsheet -- Enzyme Inhibition Constant Data from BindingDB
Found 2 hits for monomerid = 50250569
TargetNitric oxide synthase, brain(Rattus norvegicus (rat))
Northwestern University
Curated by ChEMBL
LigandPNGBDBM50250569(CHEMBL4084484)
Affinity DataKi:  541nM. Assay description: Inhibition of rat neuronal NOS expressed in Escherichia coli using L-arginine as substrate assessed as reduction in NO production by measuring oxidat...
Ligand InfoPC cidPC sidPDB
TargetNitric oxide synthase, inducible(Mus musculus (mouse))
Northwestern University
Curated by ChEMBL
LigandPNGBDBM50250569(CHEMBL4084484)
Affinity DataKi:  3.60E+4nM. Assay description: Inhibition of mouse macrophage iNOS expressed in Escherichia coli using L-arginine as substrate assessed as reduction in NO production by measuring o...
Ligand InfoPC cidPC sidPDB
In DepthDetails ArticlePubMed