BDBM50250572 CHEMBL4071288
SMILES CNCc1cccc(c1)-c1cncc(CCc2cc(C)cc(N)n2)c1
InChI Key InChIKey=MGNVQSKYSZRQCR-UHFFFAOYSA-N
Data  4 KI
PDB links: 2 PDB IDs match this monomer.
  Tab Delimited (TSV)   2D SDfile   Computed 3D by Vconf -m prep SDfile
Find this compound or compounds like it in BindingDB:
Activity Spreadsheet -- Enzyme Inhibition Constant Data from BindingDB
Found 4 hits for monomerid = 50250572
TargetNitric oxide synthase, brain(Rattus norvegicus (rat))
Northwestern University
Curated by ChEMBL
LigandPNGBDBM50250572(CHEMBL4071288)
Affinity DataKi:  47nM. Assay description: Inhibition of rat neuronal NOS expressed in Escherichia coli using L-arginine as substrate assessed as reduction in NO production by measuring oxidat...
TargetNitric oxide synthase, brain(Homo sapiens (Human))
Northwestern University
Curated by ChEMBL
LigandPNGBDBM50250572(CHEMBL4071288)
Affinity DataKi:  82nM. Assay description: Inhibition of human neuronal NOS expressed in Escherichia coli using L-arginine as substrate assessed as reduction in NO production by measuring oxid...
TargetNitric oxide synthase, inducible(Mus musculus (mouse))
Northwestern University
Curated by ChEMBL
LigandPNGBDBM50250572(CHEMBL4071288)
Affinity DataKi:  3.01E+3nM. Assay description: Inhibition of mouse macrophage iNOS expressed in Escherichia coli using L-arginine as substrate assessed as reduction in NO production by measuring o...
In DepthDetails ArticlePubMed
TargetNitric oxide synthase, endothelial(Homo sapiens (Human))
Northwestern University
Curated by ChEMBL
LigandPNGBDBM50250572(CHEMBL4071288)
Affinity DataKi:  8.67E+3nM. Assay description: Inhibition of human endothelial NOS expressed in Escherichia coli using L-arginine as substrate assessed as reduction in NO production by measuring o...
In DepthDetails ArticlePubMed