BDBM50251197 CHEMBL4063425
SMILES C[C@H]1CNCCN1C(=O)c1nc(Nc2cc([nH]n2)C2CC2)c2cc(Cl)ccc2n1
InChI Key InChIKey=GPOFFPKHCADYGY-NSHDSACASA-N
Data  2 KI
  Tab Delimited (TSV)   2D SDfile   Computed 3D by Vconf -m prep SDfile
Find this compound or compounds like it in BindingDB:
Activity Spreadsheet -- Enzyme Inhibition Constant Data from BindingDB
Found 2 hits for monomerid = 50251197
TargetSerine/threonine-protein kinase PAK 4(Homo sapiens (Human))
Shenyang Pharmaceutical University
Curated by ChEMBL
LigandPNGBDBM50251197(CHEMBL4063425)
Affinity DataKi:  26nM. Assay description: Inhibition of human PAK4 kinase domain using coumarin and fluorescein-labeled ser/thr20 peptide as substrate preincubated for 15 mins followed by ATP...
Ligand InfoPC cidPC sid
In DepthDetails ArticlePubMed
TargetSerine/threonine-protein kinase PAK 1(Homo sapiens (Human))
Shenyang Pharmaceutical University
Curated by ChEMBL
LigandPNGBDBM50251197(CHEMBL4063425)
Affinity DataKi:  383nM. Assay description: Inhibition of human PAK1 kinase domain using coumarin and fluorescein-labeled ser/thr19 peptide as substrate preincubated for 15 mins followed by ATP...
Ligand InfoPC cidPC sid
In DepthDetails ArticlePubMed