BDBM50256419 CHEMBL480542::N7-(2-(4-(2,4-difluorophenyl)piperazin-1-yl)ethyl)-N7-methyl-2-(oxazol-5-yl)-[1,2,4]triazolo[1,5-c]pyrimidine-5,7-diamine
SMILES CN(CCN1CCN(CC1)c1ccc(F)cc1F)c1cc2nc(nn2c(N)n1)-c1cnco1
InChI Key InChIKey=IOXYCIDLLJVUPF-UHFFFAOYSA-N
Data  1 KI
  Tab Delimited (TSV)   2D SDfile   Computed 3D by Vconf -m prep SDfile
Find this compound or compounds like it in BindingDB:
Activity Spreadsheet -- Enzyme Inhibition Constant Data from BindingDB
Found 1 hit for monomerid = 50256419
TargetAdenosine receptor A2a(Homo sapiens (Human))
Schering-Plough Research Institute
Curated by ChEMBL
LigandPNGBDBM50256419(CHEMBL480542 | N7-(2-(4-(2,4-difluorophenyl)pipera...)
Affinity DataKi:  0.300nM. Assay description: Displacement of [3H]SCH58261 from human adenosine A2A receptor expressed in HEK293 cells
In DepthDetails ArticlePubMed