BDBM50258724 CHEMBL4096369
SMILES CN(C)c1cccc(CNCc2ccc3ccc(N)nc3c2)c1
InChI Key InChIKey=SOVIURHDFSQRNW-UHFFFAOYSA-N
Data  4 KI
PDB links: 3 PDB IDs match this monomer.
  Tab Delimited (TSV)   2D SDfile   Computed 3D by Vconf -m prep SDfile
Find this compound or compounds like it in BindingDB:
Activity Spreadsheet -- Enzyme Inhibition Constant Data from BindingDB
Found 4 hits for monomerid = 50258724
TargetNitric oxide synthase, brain(Rattus norvegicus (rat))
Northwestern University
Curated by ChEMBL
LigandPNGBDBM50258724(CHEMBL4096369)
Affinity DataKi:  421nM. Assay description: Inhibition of recombinant rat nNOS expressed in Escherichia coli using L-arginine as substrate after 30 secs by hemoglobin capture assay
TargetNitric oxide synthase, brain(Homo sapiens (Human))
Northwestern University
Curated by ChEMBL
LigandPNGBDBM50258724(CHEMBL4096369)
Affinity DataKi:  1.02E+3nM. Assay description: Inhibition of recombinant human nNOS expressed in Escherichia coli using L-arginine as substrate after 30 secs by hemoglobin capture assay
TargetNitric oxide synthase, endothelial(Bos taurus (bovine))
Northwestern University
Curated by ChEMBL
LigandPNGBDBM50258724(CHEMBL4096369)
Affinity DataKi:  6.53E+3nM. Assay description: Inhibition of recombinant bovine eNOS expressed in Escherichia coli using L-arginine as substrate after 30 secs by hemoglobin capture assay
In DepthDetails ArticlePubMed
TargetNitric oxide synthase, inducible(Mus musculus (mouse))
Northwestern University
Curated by ChEMBL
LigandPNGBDBM50258724(CHEMBL4096369)
Affinity DataKi:  3.01E+4nM. Assay description: Inhibition of recombinant mouse macrophage iNOS expressed in Escherichia coli using L-arginine as substrate after 30 secs by hemoglobin capture assay
In DepthDetails ArticlePubMed