BDBM50262403 CHEMBL4080621
SMILES Cn1c(c(-c2ccc(CO)cc2)c2c(Cl)ccnc12)-c1ccc(cc1)N1CCNCC1
InChI Key InChIKey=LGVBWTYRZTXNEO-UHFFFAOYSA-N
Data  3 IC50
PDB links: 1 PDB ID matches this monomer.
  Tab Delimited (TSV)   2D SDfile   Computed 3D by Vconf -m prep SDfile
Find this compound or compounds like it in BindingDB:
Activity Spreadsheet -- Enzyme Inhibition Constant Data from BindingDB
Found 3 hits for monomerid = 50262403
TargetSerine/threonine-protein kinase pim-1(Homo sapiens (Human))
Sanofi Genzyme
Curated by ChEMBL
LigandPNGBDBM50262403(CHEMBL4080621)
Affinity DataIC50:  400nM. Assay description: Inhibition of PIM1 (unknown origin) assessed as reduction in full length human BAD phosphorylation at Ser112 residues by TR-FRET assay
In DepthDetails ArticlePubMed
TargetSerine/threonine-protein kinase pim-2(Homo sapiens (Human))
Sanofi Genzyme
Curated by ChEMBL
LigandPNGBDBM50262403(CHEMBL4080621)
Affinity DataIC50:  1.38E+4nM. Assay description: Inhibition of PIM2 (unknown origin) assessed as reduction in full length human BAD phosphorylation at Ser112 residues by TR-FRET assay
In DepthDetails ArticlePubMed
TargetSerine/threonine-protein kinase pim-3(Homo sapiens (Human))
Sanofi Genzyme
Curated by ChEMBL
LigandPNGBDBM50262403(CHEMBL4080621)
Affinity DataIC50:  1.06E+4nM. Assay description: Inhibition of PIM3 (unknown origin) assessed as reduction in full length human BAD phosphorylation at Ser112 residues by TR-FRET assay
In DepthDetails ArticlePubMed