BDBM50263946 6-(1H-imidazol-1-yl)-2-(4-(4-(2-isopropoxyphenyl)piperazin-1-yl)butyl)pyridazin-3(2H)-one::CHEMBL523774
SMILES CC(C)Oc1ccccc1N1CCN(CCCCn2nc(ccc2=O)-n2ccnc2)CC1
InChI Key InChIKey=ILMAXPRFLXLJED-UHFFFAOYSA-N
Data  2 KI
  Tab Delimited (TSV)   2D SDfile   Computed 3D by Vconf -m prep SDfile
Find this compound or compounds like it in BindingDB:
Activity Spreadsheet -- Enzyme Inhibition Constant Data from BindingDB
Found 2 hits for monomerid = 50263946
Target5-hydroxytryptamine receptor 1A(Rattus norvegicus (rat))
Universit£
Curated by ChEMBL
LigandPNGBDBM50263946(6-(1H-imidazol-1-yl)-2-(4-(4-(2-isopropoxyphenyl)p...)
Affinity DataKi:  6.80nM. Assay description: Displacement of [3H]8-OH-DPAT from 5HT1A receptor in rat cortex membrane
In DepthDetails ArticlePubMed
TargetSodium-dependent serotonin transporter(Homo sapiens (Human))
Universit£
Curated by ChEMBL
LigandPNGBDBM50263946(6-(1H-imidazol-1-yl)-2-(4-(4-(2-isopropoxyphenyl)p...)
Affinity DataKi: >1.00E+4nM. Assay description: Displacement of [3H]paroxetine from SERT in human platelet membrane
In DepthDetails ArticlePubMed