BDBM50265309 2-(2H-tetrazol-5-yl)-4-(p-tolyloxy)thieno[2,3-c]pyridine::CHEMBL526487
SMILES Cc1ccc(Oc2cncc3sc(cc23)-c2nnn[nH]2)cc1
InChI Key InChIKey=YEIMDRLHFGJVBY-UHFFFAOYSA-N
Data  2 IC50
  Tab Delimited (TSV)   2D SDfile   Computed 3D by Vconf -m prep SDfile
Find this compound or compounds like it in BindingDB:
Activity Spreadsheet -- Enzyme Inhibition Constant Data from BindingDB
Found 2 hits for monomerid = 50265309
TargetCyclin-C(Homo sapiens (Human))
Genentech
Curated by ChEMBL
LigandPNGBDBM50265309(2-(2H-tetrazol-5-yl)-4-(p-tolyloxy)thieno[2,3-c]py...)
Affinity DataIC50:  1.60nM. Assay description: Inhibition of full length human recombinant His-tagged CDK8/Cyclin C expressed in baculovirus expression system by fluorescence polarization assay
In DepthDetails ArticlePubMed
TargetMitogen-activated protein kinase kinase kinase 8(Homo sapiens (Human))
Abbott Bioresearch Center
Curated by ChEMBL
LigandPNGBDBM50265309(2-(2H-tetrazol-5-yl)-4-(p-tolyloxy)thieno[2,3-c]py...)
Affinity DataIC50:  7.50E+3nM. Assay description: Inhibition of human recombinant COT by HTRF-based assay
In DepthDetails ArticlePubMed