BDBM50266023 CHEMBL515659::N-(benzo[c][1,2,5]oxadiazol-4-ylmethyl)-3-(4-methylpiperazin-1-yl)-7-(trifluoromethyl)quinoxalin-5-amine
SMILES CN1CCN(CC1)c1cnc2cc(cc(NCc3cccc4nonc34)c2n1)C(F)(F)F
InChI Key InChIKey=AUUMVXKKOQIOSI-UHFFFAOYSA-N
Data  2 IC50
  Tab Delimited (TSV)   2D SDfile   Computed 3D by Vconf -m prep SDfile
Find this compound or compounds like it in BindingDB:
Activity Spreadsheet -- Enzyme Inhibition Constant Data from BindingDB
Found 2 hits for monomerid = 50266023
TargetHepatocyte growth factor receptor(Homo sapiens (Human))
Sichuan University
Curated by ChEMBL
LigandPNGBDBM50266023(CHEMBL515659 | N-(benzo[c][1,2,5]oxadiazol-4-ylmet...)
Affinity DataIC50:  31nM. Assay description: Inhibition of human c-MET
In DepthDetails ArticlePubMed
TargetHepatocyte growth factor receptor(Homo sapiens (Human))
Sichuan University
Curated by ChEMBL
LigandPNGBDBM50266023(CHEMBL515659 | N-(benzo[c][1,2,5]oxadiazol-4-ylmet...)
Affinity DataIC50:  31nM. Assay description: Inhibition of human recombinant his-tagged c-Met by TR-FRET assay
In DepthDetails ArticlePubMed