BDBM50267100 4-[(5-Naphthalen-2-ylmethylene-4-oxo-2-phenyliminothiazolidin-3-yl)methyl] benzoic acid::CHEMBL476666
SMILES OC(=O)c1ccc(CN2\C(S\C(=C/c3ccc4ccccc4c3)C2=O)=N\c2ccccc2)cc1
InChI Key InChIKey=YMCAFJIHSRLDLR-HZPABMAHSA-N
Data  4 IC50
  Tab Delimited (TSV)   2D SDfile   Computed 3D by Vconf -m prep SDfile
Find this compound or compounds like it in BindingDB:
Activity Spreadsheet -- Enzyme Inhibition Constant Data from BindingDB
Found 4 hits for monomerid = 50267100
TargetTyrosine-protein phosphatase non-receptor type 1(Homo sapiens (Human))
University Of Messina
Curated by ChEMBL
LigandPNGBDBM50267100(4-[(5-Naphthalen-2-ylmethylene-4-oxo-2-phenylimino...)
Affinity DataIC50:  1.90E+3nM. Assay description: Inhibition of GST-tagged human PTP1B
In DepthDetails ArticlePubMed
TargetLow molecular weight phosphotyrosine protein phosphatase(Saccharomyces cerevisiae)
University Of Messina
Curated by ChEMBL
LigandPNGBDBM50267100(4-[(5-Naphthalen-2-ylmethylene-4-oxo-2-phenylimino...)
Affinity DataIC50:  2.76E+4nM. Assay description: Inhibition of Saccharomyces cerevisiae Ltp1
In DepthDetails ArticlePubMed
TargetLow molecular weight phosphotyrosine protein phosphatase(Homo sapiens (Human))
University Of Messina
Curated by ChEMBL
LigandPNGBDBM50267100(4-[(5-Naphthalen-2-ylmethylene-4-oxo-2-phenylimino...)
Affinity DataIC50:  1.38E+4nM. Assay description: Inhibition of GST-tagged human LMW PTP1B IF1 isoform
In DepthDetails ArticlePubMed
TargetLow molecular weight phosphotyrosine protein phosphatase(Homo sapiens (Human))
University Of Messina
Curated by ChEMBL
LigandPNGBDBM50267100(4-[(5-Naphthalen-2-ylmethylene-4-oxo-2-phenylimino...)
Affinity DataIC50:  3.70E+3nM. Assay description: Inhibition of GST-tagged human LMW PTP1B IF1 isoform
In DepthDetails ArticlePubMed