BDBM50271802 CHEMBL4126927
SMILES OC(=O)C(\S)=C\c1csc2ccccc12
InChI Key InChIKey=RAMCKYVBVNEIFT-UITAMQMPSA-N
Data  1 IC50
PDB links: 1 PDB ID matches this monomer.
  Tab Delimited (TSV)   2D SDfile   Computed 3D by Vconf -m prep SDfile
Find this compound or compounds like it in BindingDB:
Activity Spreadsheet -- Enzyme Inhibition Constant Data from BindingDB
Found 1 hit for monomerid = 50271802
TargetMetallo-beta-lactamase type 2(Bacillus cereus)
University Of Oxford
Curated by ChEMBL
LigandPNGBDBM50271802(CHEMBL4126927)
Affinity DataIC50:  3.10E+3nM. Assay description: Inhibition of recombinant Bacillus cereus BC2 expressed in Escherichia coli BL21 (DE3) cells using FC4-FC5 as substrate by fluorescence-based assay