BDBM50273900 CHEMBL4128261
SMILES Cn1ncc2cc(ccc12)-c1ccc(cc1)C1=NC2(CC2)C(=O)N1C[C@@H]1CCN(C1)C(=O)C1CC1
InChI Key InChIKey=KYFZEWZCYBWMGN-GOSISDBHSA-N
Data  1 IC50
PDB links: 1 PDB ID matches this monomer.
  Tab Delimited (TSV)   2D SDfile   Computed 3D by Vconf -m prep SDfile
Find this compound or compounds like it in BindingDB:
Activity Spreadsheet -- Enzyme Inhibition Constant Data from BindingDB
Found 1 hit for monomerid = 50273900
TargetFatty acid synthase(Homo sapiens (Human))
Janssen Research And Development
Curated by ChEMBL
LigandPNGBDBM50273900(CHEMBL4128261)
Affinity DataIC50:  30nM. Assay description: Inhibition of human full length FASN using [3H]-acetyl-CoA/malonyl-CoA as substrate after 60 mins in presence of NADPH by scintillation proximity ass...