BDBM50275379 4-(2-oxo-2,3-dihydro-1H-benzo[d]imidazol-1-yl)-N-(3-(trifluoromethylthio)phenyl)-1,4'-bipiperidine-1'-carboxamide::CHEMBL486331
SMILES FC(F)(F)Sc1cccc(NC(=O)N2CCC(CC2)N2CCC(CC2)n2c3ccccc3[nH]c2=O)c1
InChI Key InChIKey=CKUGQYKWEJWUKL-UHFFFAOYSA-N
Data  5 EC50
  Tab Delimited (TSV)   2D SDfile   Computed 3D by Vconf -m prep SDfile
Find this compound or compounds like it in BindingDB:
Activity Spreadsheet -- Enzyme Inhibition Constant Data from BindingDB
Found 5 hits for monomerid = 50275379
TargetMuscarinic acetylcholine receptor M5(Homo sapiens (Human))
Vanderbilt University Medical Center
Curated by ChEMBL
LigandPNGBDBM50275379(4-(2-oxo-2,3-dihydro-1H-benzo[d]imidazol-1-yl)-N-(...)
Affinity DataEC50: >3.00E+4nM. Assay description: Agonist activity at muscarinic M5 receptor (unknown origin)
In DepthDetails ArticlePubMed
TargetMuscarinic acetylcholine receptor M2(Homo sapiens (Human))
Vanderbilt University Medical Center
Curated by ChEMBL
LigandPNGBDBM50275379(4-(2-oxo-2,3-dihydro-1H-benzo[d]imidazol-1-yl)-N-(...)
Affinity DataEC50: >3.00E+4nM. Assay description: Agonist activity at muscarinic M2 receptor (unknown origin)
In DepthDetails ArticlePubMed
TargetMuscarinic acetylcholine receptor M1(Homo sapiens (Human))
Vanderbilt University Medical Center
Curated by ChEMBL
LigandPNGBDBM50275379(4-(2-oxo-2,3-dihydro-1H-benzo[d]imidazol-1-yl)-N-(...)
Affinity DataEC50:  6.50E+3nM. Assay description: Agonist activity at muscarinic M1 receptor (unknown origin)
In DepthDetails ArticlePubMed
TargetMuscarinic acetylcholine receptor M4(Homo sapiens (Human))
Vanderbilt University Medical Center
Curated by ChEMBL
LigandPNGBDBM50275379(4-(2-oxo-2,3-dihydro-1H-benzo[d]imidazol-1-yl)-N-(...)
Affinity DataEC50: >3.00E+4nM. Assay description: Agonist activity at muscarinic M4 receptor (unknown origin)
In DepthDetails ArticlePubMed
TargetMuscarinic acetylcholine receptor M3(Homo sapiens (Human))
Vanderbilt University Medical Center
Curated by ChEMBL
LigandPNGBDBM50275379(4-(2-oxo-2,3-dihydro-1H-benzo[d]imidazol-1-yl)-N-(...)
Affinity DataEC50: >3.00E+4nM. Assay description: Agonist activity at muscarinic M3 receptor (unknown origin)
In DepthDetails ArticlePubMed