BDBM50279995 8-Fluoro-1,2,3,4-tetrahydro-acridin-9-ylamine::9-Amino-8-fluoro-1,2,3,4-tetrahydro-acridinium::CHEMBL132030
SMILES Nc1c2CCCCc2nc2cccc(F)c12
InChI Key InChIKey=PADRKJUJDBXCPM-UHFFFAOYSA-N
Data  2 IC50
  Tab Delimited (TSV)   2D SDfile   Computed 3D by Vconf -m prep SDfile
Find this compound or compounds like it in BindingDB:
Activity Spreadsheet -- Enzyme Inhibition Constant Data from BindingDB
Found 2 hits for monomerid = 50279995
TargetAcetylcholinesterase(Homo sapiens (Human))
Universitat De Barcelona
Curated by ChEMBL
LigandPNGBDBM50279995(8-Fluoro-1,2,3,4-tetrahydro-acridin-9-ylamine | 9-...)
Affinity DataIC50:  79nM. Assay description: Inhibitory activity against human erythrocyte acetylcholinesterase
In DepthDetails ArticlePubMed
TargetAcetylcholinesterase(Homo sapiens (Human))
Universitat De Barcelona
Curated by ChEMBL
LigandPNGBDBM50279995(8-Fluoro-1,2,3,4-tetrahydro-acridin-9-ylamine | 9-...)
Affinity DataIC50:  78nM. Assay description: In vitro inhibition of acetylcholinesterase isolated from human erythrocytes.
In DepthDetails Article