BDBM50280464 CHEMBL345711::[(2R,3R)-2-(2,2-Diphenyl-ethyl)-1-aza-bicyclo[2.2.2]oct-3-yl]-(2-trifluoromethyl-benzyl)-amine
SMILES FC(F)(F)c1ccccc1CN[C@@H]1C2CCN(CC2)[C@@H]1C(c1ccccc1)c1ccccc1
InChI Key InChIKey=SJOKZBTYGQAZNH-KAYWLYCHSA-N
Data  2 IC50
  Tab Delimited (TSV)   2D SDfile   Computed 3D by Vconf -m prep SDfile
Find this compound or compounds like it in BindingDB:
Activity Spreadsheet -- Enzyme Inhibition Constant Data from BindingDB
Found 2 hits for monomerid = 50280464
TargetSubstance-P receptor(Rattus norvegicus (rat))
TBA
Curated by ChEMBL
LigandPNGBDBM50280464(CHEMBL345711 | [(2R,3R)-2-(2,2-Diphenyl-ethyl)-1-a...)
Affinity DataIC50:  740nM. Assay description: Binding affinity towards Tachykinin receptor 1 in rat cerebral cortex membranes was determined by using 125 [I]-BHSP as radioligand
In DepthDetails Article
TargetSubstance-P receptor(GUINEA PIG)
TBA
Curated by ChEMBL
LigandPNGBDBM50280464(CHEMBL345711 | [(2R,3R)-2-(2,2-Diphenyl-ethyl)-1-a...)
Affinity DataIC50:  33nM. Assay description: Binding affinity towards Tachykinin receptor 1 binding in guinea pig cerebral cortex membranes was determined using [3H]SP as the radioligand
In DepthDetails Article