BDBM50281187 (S)-Piperazine-1,2,4-tricarboxylic acid 2-[(3-diethylamino-propyl)-amide] 4-dipentylamide 1-diphenylamide::CHEMBL90416
SMILES CCCCCN(CCCCC)C(=O)N1CCN([C@@H](C1)C(=O)NCCCN(CC)CC)C(=O)N(c1ccccc1)c1ccccc1
InChI Key InChIKey=YPROEHWVHUDTQP-XIFFEERXSA-N
Data  2 IC50
  Tab Delimited (TSV)   2D SDfile   Computed 3D by Vconf -m prep SDfile
Find this compound or compounds like it in BindingDB:
Activity Spreadsheet -- Enzyme Inhibition Constant Data from BindingDB
Found 2 hits for monomerid = 50281187
TargetSubstance-P receptor(Homo sapiens (Human))
TBA
Curated by ChEMBL
LigandPNGBDBM50281187((S)-Piperazine-1,2,4-tricarboxylic acid 2-[(3-diet...)
Affinity DataIC50:  41nM. Assay description: Inhibition of [125I]-Substance P binding to human NK1 receptors in CHO cells
In DepthDetails Article
TargetSubstance-P receptor(Homo sapiens (Human))
TBA
Curated by ChEMBL
LigandPNGBDBM50281187((S)-Piperazine-1,2,4-tricarboxylic acid 2-[(3-diet...)
Affinity DataIC50:  41nM. Assay description: Inhibition of [125I]-substance P binding to human neurokinin-1 (hNK-1) receptor in CHO cells
In DepthDetails Article