BDBM50281630 C,C,C-Trifluoro-N-{4'-[(2-trifluoromethyl-5,6,7,8-tetrahydro-quinazolin-4-ylamino)-methyl]-biphenyl-2-yl}-methanesulfonamide::CHEMBL165572
SMILES FC(F)(F)c1nc2CCCCc2c(NCc2ccc(cc2)-c2ccccc2NS(=O)(=O)C(F)(F)F)n1
InChI Key InChIKey=FENHKXVPGQPENW-UHFFFAOYSA-N
Data  2 IC50
  Tab Delimited (TSV)   2D SDfile   Computed 3D by Vconf -m prep SDfile
Find this compound or compounds like it in BindingDB:
Activity Spreadsheet -- Enzyme Inhibition Constant Data from BindingDB
Found 2 hits for monomerid = 50281630
LigandPNGBDBM50281630(C,C,C-Trifluoro-N-{4'-[(2-trifluoromethyl-5,6,7,8-...)
Affinity DataIC50:  100nM. Assay description: Competitive inhibition of Angiotensin II receptor binding of radiolabeled AII to rat adrenal glomerulosa tissue by 50%
In DepthDetails
TargetType-2 angiotensin II receptor(Homo sapiens (Human))
Bristol-Myers Squibb Pharmaceutical Research And Development
Curated by ChEMBL
LigandPNGBDBM50281630(C,C,C-Trifluoro-N-{4'-[(2-trifluoromethyl-5,6,7,8-...)
Affinity DataIC50:  100nM. Assay description: Antagonist activity at angiotensin 2 receptor
In DepthDetails ArticlePubMed